{"text_format":"1","workbook":"xlsx","n_sheets":6,"sheets":["0101","22.05","32.02","22.04","FOTOS FINAIS","TESTE ESTANQUEIDADE"],"not_rendered":{"charts":0,"images":22,"macros":1,"external_links":0,"defined_names":8,"comments":0,"pivot_tables":0},"unopened":[],"bounds":{"document_bytes":16777216,"sheet_cells":100000,"rows_first":2000,"rows_last":500,"rows_between":2000,"halvings":0,"cell_chars":16384,"cell_head_chars":4096},"cells_cut":0,"cells_raw":0,"read":"whole","date_system":"1900"}

{"sheet":"0101","index":0,"n_rows":22,"n_cols":2,"rows_kept":22,"cut":false,"hidden":false,"merged":[[19,5,19,6],[0,0,1,11],[2,0,2,11],[14,5,14,6],[9,9,9,10],[10,10,10,11],[3,1,3,3],[4,1,4,3],[14,7,14,10],[13,1,13,11]]}
["CONTROLE DE SERVIÇOS"]
[]
["MIG Gas e Aquecedores"]
["NOME DA OBRA:","AUTO POSTO DE COMBUSTIVEIS PASQUALOTTO LTDA EPP"]
["ENDEREÇO: ","R TAINHAS"]
["Nº",685]
["CEP.:",95400000]
["BAIRRO:","TAINHAS"]
["CIDADE:","SÃO FRANCISCO DO SUL"]
["OS: ",2405245935]
["N.º PROJETO:","03.0259.2405245935.01-GE"]
["Data Visita 22.05:  "]
[]
["DESCRICAO CENTRAL: "]
["NOME PROJETISTA: ","ALEX"]
["NOME CLIENTE:","XX"]
[]
["Data 22.04","2024-10-01"]
[]
["EXECUTANTE:","JEFERSON MACIEL"]
["ART:",13409214]
["DATA TESTE:",{"$f":"B18","v":"2024-10-01"}]

{"sheet":"22.05","index":1,"n_rows":57,"n_cols":11,"rows_kept":57,"cut":false,"hidden":false,"merged":[[56,2,56,4],[56,7,56,8],[11,9,11,10],[5,1,5,10],[8,7,8,8],[7,2,7,8],[9,9,9,10],[14,1,20,10]]}
[]
[]
[]
[]
[null,null," NOVO CLIENTE                                                                              ",null,null,null,"AS BUILT      ",null,null,"   ADEQUAÇÃO"]
[null,"INFORMAÇÕES DO CLIENTE (LEVANTAMENTO EM CAMPO)"]
[null,"RAZÃO SOCIAL:",{"$f":"'0101'!B4","v":"AUTO POSTO DE COMBUSTIVEIS PASQUALOTTO LTDA EPP"}]
[null,"ENDEREÇO:",{"$f":"'0101'!B5","v":"R TAINHAS"},null,null,null,null,null,null,"Nº.:",{"$f":"IF('0101'!B6=0,\"\",'0101'!B6)","v":685}]
[null,"CIDADE:",{"$f":"'0101'!B9","v":"SÃO FRANCISCO DO SUL"},null,null,null,"BAIRRO:",{"$f":"IF('0101'!B8=0,\"\",'0101'!B8)","v":"TAINHAS"},null,"CEP:",{"$f":"IF('0101'!B7=0,\"-----\",'0101'!B7)","v":95400000}]
[null,"Nº PROJETO:",{"$f":"IF('0101'!B11=0,\"\",'0101'!B11)","v":"03.0259.2405245935.01-GE"},null,null,null,null,"BASE INSTALADA:",null,{"$f":"'0101'!B10","v":2405245935}]
[]
[null,null,null,null,null,null,null,null,"Data da Visita",{"$f":"IF('0101'!B12=0,\"\",'0101'!B12)","v":""}]
[]
[]
[null,{"$f":"'0101'!B14:L14","v":0}]
[]
[]
[]
[]
[]
[]
[]
[]
[]
[]
[]
[]
[]
[]
[]
[]
[]
[]
[]
[]
[]
[]
[]
[]
[]
[]
[]
[]
[]
[]
[]
[]
[]
[]
[]
[]
[]
[]
[]
[]
[]
[null,"Nome Projetista:                                                                   ",{"$f":"IF('0101'!B15=0,\"\",'0101'!B15)","v":"ALEX"},null,null,"Nome Cliente:",null,{"$f":"'0101'!B16","v":"XX"},null,"Tel.:","-----------------------"]

{"sheet":"32.02","index":2,"n_rows":41,"n_cols":11,"rows_kept":41,"cut":false,"hidden":false,"merged":[[24,1,24,11],[40,1,40,11],[8,0,8,9],[5,1,5,2],[5,7,5,8],[5,5,5,6]]}
[]
[]
[]
[]
[]
[null,"RAZÃO SOCIAL:",null,null,null,"CÓDIGO ERP:",null,"BASE INSTALADA:",null,"OS:"]
[null,{"$f":"IF('0101'!B4:L4=0,\"\",'0101'!B4:D4)","v":"AUTO POSTO DE COMBUSTIVEIS PASQUALOTTO LTDA EPP"},null,null,null,null,null,null,{"$f":"'0101'!B10","v":2405245935},{"$f":"IF('0101'!J10=0,\"\",'0101'!J10)","v":""},329959]
[]
["DOCUMENTAÇÃO DE PROJETO"]
[]
[]
[]
[]
[]
[]
[]
[]
[]
[]
[]
[]
[]
[]
[]
[null,"DOCUMENTAÇÃO DE INSTALAÇÃO"]
[]
[]
[]
[]
[]
[]
[]
[]
[]
[]
[]
[]
[]
[]
[]
[null,"DOCUMENTAÇÃO DE INSTALAÇÃO"]

{"sheet":"22.04","index":3,"n_rows":25,"n_cols":11,"rows_kept":25,"cut":false,"hidden":false,"merged":[[11,0,11,10],[4,1,4,10],[5,2,5,10],[6,2,6,8],[7,2,7,5],[7,7,7,8],[8,2,8,6],[8,9,8,10]]}
[]
[]
[]
[]
[null,"INFORMAÇÕES DO CLIENTE (LEVANTAMENTO EM CAMPO)"]
[null,"RAZÃO SOCIAL:",{"$f":"'0101'!B4","v":"AUTO POSTO DE COMBUSTIVEIS PASQUALOTTO LTDA EPP"}]
[null,"ENDEREÇO:",{"$f":"'0101'!B5","v":"R TAINHAS"},null,null,null,null,null,null,"Nº.:",{"$f":"IF('0101'!B6=0,\"\",'0101'!B6)","v":685}]
[null,"CIDADE:",{"$f":"'0101'!B9","v":"SÃO FRANCISCO DO SUL"},null,null,null,"BAIRRO:",{"$f":"IF('0101'!B8=0,\"\",'0101'!B8)","v":"TAINHAS"},null,"CEP:",{"$f":"IF('0101'!B7=0,\"------\",'0101'!B7)","v":95400000}]
[null,"Nº PROJETO:",{"$f":"IF('0101'!B11=0,\"\",'0101'!B11)","v":"03.0259.2405245935.01-GE"}]
[null,"Este registro tem por objetivo que a instalação esteja de acordo com as normas vigentes e conforme o conceito estabelecido no projeto."]
[]
["INSPEÇÃO PRÉVIA"]
[null,null,null,null,null,null,"   "," "]
[]
[]
[]
[]
[null,"Nome Cliente:",{"$f":"'0101'!B4","v":"AUTO POSTO DE COMBUSTIVEIS PASQUALOTTO LTDA EPP"},null,null,null,null,null,null,"Data:",{"$f":"IF('0101'!B18=0,\"\",'0101'!B18)","v":"2024-10-01"}]
[]
[]
[]
[]
[]
[]
[null,null,null," "]

{"sheet":"FOTOS FINAIS","index":4,"n_rows":5,"n_cols":1,"rows_kept":5,"cut":false,"hidden":false,"merged":[[3,0,3,10],[0,0,2,10],[4,0,63,10]]}
["INSPEÇÃO FINAL"]
[]
[]
["FOTOS APÓS A INSTALAÇÃO"]
["   "]

{"sheet":"TESTE ESTANQUEIDADE","index":5,"n_rows":53,"n_cols":11,"rows_kept":53,"cut":false,"hidden":false,"merged":[[52,0,52,8],[4,0,4,8],[8,1,8,6],[9,1,9,3],[11,1,11,3],[46,1,46,3],[47,1,47,2]]}
[]
[]
[]
[]
["Laudo de teste de estanqueidade realizado conforme normas da ABNT NBR- 13523 e NBR-15526."]
[]
["Dados da obra: "]
[]
["Cliente: ",{"$f":"'0101'!B4:L4","v":"AUTO POSTO DE COMBUSTIVEIS PASQUALOTTO LTDA EPP"}]
["Endereço: ",{"$f":"'0101'!B5:H5","v":"R TAINHAS"},null,null,{"$f":"IF('0101'!B6=0,\"\",'0101'!B6)","v":685}]
["Bairro:",{"$f":"IF('0101'!B8=0,\"\",'0101'!B8)","v":"TAINHAS"}]
["Município: ",{"$f":"IF('0101'!B9=0,\"\",'0101'!B9)","v":"SÃO FRANCISCO DO SUL"}]
[]
["Dados referentes aos testes: "]
["Rede de Alimentação (Coletor)"]
["Nº do manômetro: ",null,"0202/2024"]
[]
["Pressão: ","17,4 kgf/cm² ","Tempo:  15 min  Situação: ( X   ) Aprovado (    ) Reprovado (  ) Não se Aplica",null,null,null,null,null,null,null,"VALIDO ATE 23/06/2025"]
[]
["Rede  de 1° Estagio",null,null,null,null,null,null,null,null,null,"Quando é KIT vai o numero do certificado no 3204"]
["Nº do manômetro:",null,"0206/2024"]
[]
["Pressão: ","6,0 kgf/cm²    ","Tempo:  60 min  Situação: ( X ) Aprovado (    )Reprovado (    ) Não se Aplica"]
[]
["Rede Conectada"]
["Nº do manômetro:",null,"0206/2024"]
[]
["Pressão: ","1,5 kgf/cm² ","Tempo:  30 min  Situação: ( X ) Aprovado (    )Reprovado (    ) Não se Aplica"]
[]
["Rede de 2° Estágio"]
["Nº do manômetro:________"]
[]
["Pressão: ____ kgf/cm²    Tempo:  ----------  Situação: (    ) Aprovado (    )Reprovado ( X ) Não se Aplica"]
[]
["Quadro de Medição e Regulagem - Secundário"]
["Nº do manômetro:________"]
[]
["Pressão: ____ kgf/cm²    Tempo:  --------  Situação: (    ) Aprovado (    )Reprovado ( X ) Não se Aplica"]
[" "]
["Quadro de Medição e Regulagem - ERU"]
["Nº do manômetro:________"]
[]
["Pressão: ____ kgf/cm²    Tempo:  --------  Situação: (    ) Aprovado (    )Reprovado ( X ) Não se Aplica"]
[]
["Empresa executante: GRA Instalações e Transportes de Gás Eireli"]
["CNPJ: 12.507.499/0001-07"]
["Executante: ",{"$f":"IF('0101'!B20:C20=0,\"\",'0101'!B20:C20)","v":"JEFERSON MACIEL"}]
["N° de ART: ",{"$f":"IF('0101'!B21:C21=0,\"\",'0101'!B21:C21)","v":13409214}]
["Data da execução do teste de Estanqueidade: ",null,null,null,{"$f":"IF('0101'!B22=0,\"\",'0101'!B22)","v":"2024-10-01"}]
["Engenheiro Responsável: MIGUEL EDUARDO SUDBRACK"]
[" CREA: RS 038959"]
["_________________________________________"]
["FO31_Laudo de teste de estanqueidade_Ultragaz_r0_220923"]