{"text_format":"1","workbook":"xlsx","n_sheets":4,"sheets":["Principal","Regras e Promoções","Impostos","Tabela"],"not_rendered":{"charts":0,"images":13,"macros":1,"external_links":0,"defined_names":0,"comments":0,"pivot_tables":0},"unopened":[],"bounds":{"document_bytes":16777216,"sheet_cells":100000,"rows_first":2000,"rows_last":500,"rows_between":2000,"halvings":0,"cell_chars":16384,"cell_head_chars":4096},"cells_cut":0,"cells_raw":0,"read":"whole","date_system":"1900"}

{"sheet":"Principal","index":0,"n_rows":29,"n_cols":27,"rows_kept":29,"cut":false,"hidden":false,"merged":[[28,17,31,18],[28,1,31,2],[23,12,26,13],[1,1,5,2],[7,1,10,2],[12,1,15,2],[17,1,20,2],[8,16,11,17],[8,19,11,20],[8,22,11,23],[1,12,6,13],[13,12,18,13]]}
[]
[null,{"$error":"#VALUE!"},null,null,"Fornecedor","Produto","Preço de Custo","Preço Minimo","Markup PM","Preço Sugestivo","Markup PS",null,{"$error":"#VALUE!"},null,null,"Fornecedor",null,"Produto",null,null,null,null,"Preço de Custo","Preço Minimo","Markup PM","Preço Sugestivo","Markup PS"]
[null,null,null,null,{"$f":"IFERROR(VLOOKUP(F3,Tabela!$B$1:$C$69,2,FALSE),\"\")","v":"VITAFOR"},{"$f":"IFERROR(INDEX(Tabela!$B$2:$B$69, _xlfn.AGGREGATE(15, 6, (ROW(Tabela!$B$2:$B$69)-ROW(Tabela!$B$2)+1) / ((Tabela!$D$2:$D$69=Principal!$B$7) * (Tabela!$E$2:$E$69=\"Ativo\")), ROW(A1))), \"\")","v":"BIO OMEGA 3 (18/12) 120 CAPS"},{"$f":"IFERROR(INDEX(Tabela!$F:$F,MATCH(F3,Tabela!$B:$B,0)),\"\")","v":59.18},{"$f":"IFERROR(INDEX(Tabela!$G:$G,MATCH(F3,Tabela!$B:$B,0)),\"\")","v":98.9},{"$f":"IFERROR(INDEX(Tabela!$H:$H,MATCH($F3,Tabela!$B:$B,0)),\"\")","v":1.6711726934775264},{"$f":"IFERROR(INDEX(Tabela!$I:$I,MATCH($F3,Tabela!$B:$B,0)),\"\")","v":113.7},{"$f":"IFERROR(INDEX(Tabela!$J:$J,MATCH($F3,Tabela!$B:$B,0)),\"\")","v":1.9212571814802299},null,null,null,null,{"$f":"IFERROR(VLOOKUP(R3,Tabela!$B$1:$C$69,2,FALSE),\"\")","v":"NATURELLE"},null,{"$f":"IFERROR(INDEX(Tabela!$B$2:$B$69, _xlfn.AGGREGATE(15, 6, (ROW(Tabela!$B$2:$B$69)-ROW(Tabela!$B$2)+1) / ((Tabela!$D$2:$D$69=$M$8) * (Tabela!$E$2:$E$69=\"Ativo\")), ROW(L1))), \"\")","v":"NO RED FPS 30 - 100G UNID"},null,null,null,null,{"$f":"IFERROR(INDEX(Tabela!$F:$F,MATCH(R3,Tabela!$B:$B,0)),\"\")","v":49.74},{"$f":"IFERROR(INDEX(Tabela!$G:$G,MATCH(R3,Tabela!$B:$B,0)),\"\")","v":89.5},{"$f":"IFERROR(INDEX(Tabela!$H:$H,MATCH(R3,Tabela!$B:$B,0)),\"\")","v":1.7993566546039403},{"$f":"IFERROR(INDEX(Tabela!$I:$I,MATCH(R3,Tabela!$B:$B,0)),\"\")","v":102.9},{"$f":"IFERROR(INDEX(Tabela!$J:$J,MATCH(R3,Tabela!$B:$B,0)),\"\")","v":2.06875753920386}]
[null,null,null,null,{"$f":"IFERROR(VLOOKUP(F4,Tabela!$B$1:$C$69,2,FALSE),\"\")","v":"VITAFOR"},{"$f":"IFERROR(INDEX(Tabela!$B$2:$B$69, _xlfn.AGGREGATE(15, 6, (ROW(Tabela!$B$2:$B$69)-ROW(Tabela!$B$2)+1) / ((Tabela!$D$2:$D$69=Principal!$B$7) * (Tabela!$E$2:$E$69=\"Ativo\")), ROW(A2))), \"\")","v":"COENZIMA Q10 100MG 60 CAPS"},{"$f":"IFERROR(INDEX(Tabela!$F:$F,MATCH(F4,Tabela!$B:$B,0)),\"\")","v":86.76},{"$f":"IFERROR(INDEX(Tabela!$G:$G,MATCH(F4,Tabela!$B:$B,0)),\"\")","v":145},{"$f":"IFERROR(INDEX(Tabela!$H:$H,MATCH($F4,Tabela!$B:$B,0)),\"\")","v":1.6712770862148454},{"$f":"IFERROR(INDEX(Tabela!$I:$I,MATCH($F4,Tabela!$B:$B,0)),\"\")","v":166.8},{"$f":"IFERROR(INDEX(Tabela!$J:$J,MATCH($F4,Tabela!$B:$B,0)),\"\")","v":1.9225449515905948},null,null,null,null,{"$f":"IFERROR(VLOOKUP(R4,Tabela!$B$1:$C$69,2,FALSE),\"\")","v":"BOTANIK KOSMETICS"},null,{"$f":"IFERROR(INDEX(Tabela!$B$2:$B$69, _xlfn.AGGREGATE(15, 6, (ROW(Tabela!$B$2:$B$69)-ROW(Tabela!$B$2)+1) / ((Tabela!$D$2:$D$69=$M$8) * (Tabela!$E$2:$E$69=\"Ativo\")), ROW(L2))), \"\")","v":"NO RED FPS 40 - 60G UNID."},null,null,null,null,{"$f":"IFERROR(INDEX(Tabela!$F:$F,MATCH(R4,Tabela!$B:$B,0)),\"\")","v":51.52},{"$f":"IFERROR(INDEX(Tabela!$G:$G,MATCH(R4,Tabela!$B:$B,0)),\"\")","v":95.9},{"$f":"IFERROR(INDEX(Tabela!$H:$H,MATCH(R4,Tabela!$B:$B,0)),\"\")","v":1.861413043478261},{"$f":"IFERROR(INDEX(Tabela!$I:$I,MATCH(R4,Tabela!$B:$B,0)),\"\")","v":110.3},{"$f":"IFERROR(INDEX(Tabela!$J:$J,MATCH(R4,Tabela!$B:$B,0)),\"\")","v":2.1409161490683228}]
[null,null,null,null,{"$f":"IFERROR(VLOOKUP(F5,Tabela!$B$1:$C$69,2,FALSE),\"\")","v":"BASECOL MIX"},{"$f":"IFERROR(INDEX(Tabela!$B$2:$B$69, _xlfn.AGGREGATE(15, 6, (ROW(Tabela!$B$2:$B$69)-ROW(Tabela!$B$2)+1) / ((Tabela!$D$2:$D$69=Principal!$B$7) * (Tabela!$E$2:$E$69=\"Ativo\")), ROW(A3))), \"\")","v":"COLAG VERISOL GELATINA 30 GOMAS FR VERM. 240G"},{"$f":"IFERROR(INDEX(Tabela!$F:$F,MATCH(F5,Tabela!$B:$B,0)),\"\")","v":88.91},{"$f":"IFERROR(INDEX(Tabela!$G:$G,MATCH(F5,Tabela!$B:$B,0)),\"\")","v":142.5},{"$f":"IFERROR(INDEX(Tabela!$H:$H,MATCH($F5,Tabela!$B:$B,0)),\"\")","v":1.6027443482172985},{"$f":"IFERROR(INDEX(Tabela!$I:$I,MATCH($F5,Tabela!$B:$B,0)),\"\")","v":163.9},{"$f":"IFERROR(INDEX(Tabela!$J:$J,MATCH($F5,Tabela!$B:$B,0)),\"\")","v":1.8434371836688788},null,null,null,null,{"$f":"IFERROR(VLOOKUP(R5,Tabela!$B$1:$C$69,2,FALSE),\"\")","v":"BOTANIK KOSMETICS"},null,{"$f":"IFERROR(INDEX(Tabela!$B$2:$B$69, _xlfn.AGGREGATE(15, 6, (ROW(Tabela!$B$2:$B$69)-ROW(Tabela!$B$2)+1) / ((Tabela!$D$2:$D$69=$M$8) * (Tabela!$E$2:$E$69=\"Ativo\")), ROW(L3))), \"\")","v":"NO RED FPS 50 C/COR 60G UNID."},null,null,null,null,{"$f":"IFERROR(INDEX(Tabela!$F:$F,MATCH(R5,Tabela!$B:$B,0)),\"\")","v":61.78},{"$f":"IFERROR(INDEX(Tabela!$G:$G,MATCH(R5,Tabela!$B:$B,0)),\"\")","v":108.5},{"$f":"IFERROR(INDEX(Tabela!$H:$H,MATCH(R5,Tabela!$B:$B,0)),\"\")","v":1.7562317902233733},{"$f":"IFERROR(INDEX(Tabela!$I:$I,MATCH(R5,Tabela!$B:$B,0)),\"\")","v":124.8},{"$f":"IFERROR(INDEX(Tabela!$J:$J,MATCH(R5,Tabela!$B:$B,0)),\"\")","v":2.0200712204596956}]
[null,null,null,null,{"$f":"IFERROR(VLOOKUP(F6,Tabela!$B$1:$C$69,2,FALSE),\"\")","v":"BASECOL MIX"},{"$f":"IFERROR(INDEX(Tabela!$B$2:$B$69, _xlfn.AGGREGATE(15, 6, (ROW(Tabela!$B$2:$B$69)-ROW(Tabela!$B$2)+1) / ((Tabela!$D$2:$D$69=Principal!$B$7) * (Tabela!$E$2:$E$69=\"Ativo\")), ROW(A4))), \"\")","v":"COLAG VERISOL PECTINA 30 GOMAS FR VERM. 216G UN"},{"$f":"IFERROR(INDEX(Tabela!$F:$F,MATCH(F6,Tabela!$B:$B,0)),\"\")","v":84.9},{"$f":"IFERROR(INDEX(Tabela!$G:$G,MATCH(F6,Tabela!$B:$B,0)),\"\")","v":119.9},{"$f":"IFERROR(INDEX(Tabela!$H:$H,MATCH($F6,Tabela!$B:$B,0)),\"\")","v":1.4122497055359247},{"$f":"IFERROR(INDEX(Tabela!$I:$I,MATCH($F6,Tabela!$B:$B,0)),\"\")","v":137.9},{"$f":"IFERROR(INDEX(Tabela!$J:$J,MATCH($F6,Tabela!$B:$B,0)),\"\")","v":1.624263839811543},null,null,null,null,{"$f":"IFERROR(VLOOKUP(R6,Tabela!$B$1:$C$69,2,FALSE),\"\")","v":"KILT DISTRIBUIDORA"},null,{"$f":"IFERROR(INDEX(Tabela!$B$2:$B$69, _xlfn.AGGREGATE(15, 6, (ROW(Tabela!$B$2:$B$69)-ROW(Tabela!$B$2)+1) / ((Tabela!$D$2:$D$69=$M$8) * (Tabela!$E$2:$E$69=\"Ativo\")), ROW(L4))), \"\")","v":"NO RED LOCAO AUTOBRONZEADORA 120G"},null,null,null,null,{"$f":"IFERROR(INDEX(Tabela!$F:$F,MATCH(R6,Tabela!$B:$B,0)),\"\")","v":13.83},{"$f":"IFERROR(INDEX(Tabela!$G:$G,MATCH(R6,Tabela!$B:$B,0)),\"\")","v":34.9},{"$f":"IFERROR(INDEX(Tabela!$H:$H,MATCH(R6,Tabela!$B:$B,0)),\"\")","v":2.5234996384671002},{"$f":"IFERROR(INDEX(Tabela!$I:$I,MATCH(R6,Tabela!$B:$B,0)),\"\")","v":40.1},{"$f":"IFERROR(INDEX(Tabela!$J:$J,MATCH(R6,Tabela!$B:$B,0)),\"\")","v":2.8994938539407089}]
[null,"PURIS",null,null,{"$f":"IFERROR(VLOOKUP(F7,Tabela!$B$1:$C$69,2,FALSE),\"\")","v":"VITAFOR"},{"$f":"IFERROR(INDEX(Tabela!$B$2:$B$69, _xlfn.AGGREGATE(15, 6, (ROW(Tabela!$B$2:$B$69)-ROW(Tabela!$B$2)+1) / ((Tabela!$D$2:$D$69=Principal!$B$7) * (Tabela!$E$2:$E$69=\"Ativo\")), ROW(A5))), \"\")","v":"COLAGENO POTE NEUTRO 360G"},{"$f":"IFERROR(INDEX(Tabela!$F:$F,MATCH(F7,Tabela!$B:$B,0)),\"\")","v":66.55},{"$f":"IFERROR(INDEX(Tabela!$G:$G,MATCH(F7,Tabela!$B:$B,0)),\"\")","v":111.2},{"$f":"IFERROR(INDEX(Tabela!$H:$H,MATCH($F7,Tabela!$B:$B,0)),\"\")","v":1.670924117205109},{"$f":"IFERROR(INDEX(Tabela!$I:$I,MATCH($F7,Tabela!$B:$B,0)),\"\")","v":127.9},{"$f":"IFERROR(INDEX(Tabela!$J:$J,MATCH($F7,Tabela!$B:$B,0)),\"\")","v":1.921863260706236},null,null,null,null,{"$f":"IFERROR(VLOOKUP(R7,Tabela!$B$1:$C$69,2,FALSE),\"\")","v":""},null,{"$f":"IFERROR(INDEX(Tabela!$B$2:$B$69, _xlfn.AGGREGATE(15, 6, (ROW(Tabela!$B$2:$B$69)-ROW(Tabela!$B$2)+1) / ((Tabela!$D$2:$D$69=$M$8) * (Tabela!$E$2:$E$69=\"Ativo\")), ROW(L5))), \"\")","v":""},null,null,null,null,{"$f":"IFERROR(INDEX(Tabela!$F:$F,MATCH(R7,Tabela!$B:$B,0)),\"\")","v":""},{"$f":"IFERROR(INDEX(Tabela!$G:$G,MATCH(R7,Tabela!$B:$B,0)),\"\")","v":""},{"$f":"IFERROR(INDEX(Tabela!$H:$H,MATCH(R7,Tabela!$B:$B,0)),\"\")","v":""},{"$f":"IFERROR(INDEX(Tabela!$I:$I,MATCH(R7,Tabela!$B:$B,0)),\"\")","v":""},{"$f":"IFERROR(INDEX(Tabela!$J:$J,MATCH(R7,Tabela!$B:$B,0)),\"\")","v":""}]
[null,{"$error":"#VALUE!"},null,null,{"$f":"IFERROR(VLOOKUP(F8,Tabela!$B$1:$C$69,2,FALSE),\"\")","v":"VITAFOR"},{"$f":"IFERROR(INDEX(Tabela!$B$2:$B$69, _xlfn.AGGREGATE(15, 6, (ROW(Tabela!$B$2:$B$69)-ROW(Tabela!$B$2)+1) / ((Tabela!$D$2:$D$69=Principal!$B$7) * (Tabela!$E$2:$E$69=\"Ativo\")), ROW(A6))), \"\")","v":"COLAGENO SACHE 12G - ABACAXI"},{"$f":"IFERROR(INDEX(Tabela!$F:$F,MATCH(F8,Tabela!$B:$B,0)),\"\")","v":73.31},{"$f":"IFERROR(INDEX(Tabela!$G:$G,MATCH(F8,Tabela!$B:$B,0)),\"\")","v":124.9},{"$f":"IFERROR(INDEX(Tabela!$H:$H,MATCH($F8,Tabela!$B:$B,0)),\"\")","v":1.7037239121538672},{"$f":"IFERROR(INDEX(Tabela!$I:$I,MATCH($F8,Tabela!$B:$B,0)),\"\")","v":143.6},{"$f":"IFERROR(INDEX(Tabela!$J:$J,MATCH($F8,Tabela!$B:$B,0)),\"\")","v":1.9588050743418359},null,"NORED"]
[null,null,null,null,{"$f":"IFERROR(VLOOKUP(F9,Tabela!$B$1:$C$69,2,FALSE),\"\")","v":"VITAFOR"},{"$f":"IFERROR(INDEX(Tabela!$B$2:$B$69, _xlfn.AGGREGATE(15, 6, (ROW(Tabela!$B$2:$B$69)-ROW(Tabela!$B$2)+1) / ((Tabela!$D$2:$D$69=Principal!$B$7) * (Tabela!$E$2:$E$69=\"Ativo\")), ROW(A7))), \"\")","v":"COLAGENO SACHE 12G - LARANJA COM ACEROLA"},{"$f":"IFERROR(INDEX(Tabela!$F:$F,MATCH(F9,Tabela!$B:$B,0)),\"\")","v":73.31},{"$f":"IFERROR(INDEX(Tabela!$G:$G,MATCH(F9,Tabela!$B:$B,0)),\"\")","v":124.9},{"$f":"IFERROR(INDEX(Tabela!$H:$H,MATCH($F9,Tabela!$B:$B,0)),\"\")","v":1.7037239121538672},{"$f":"IFERROR(INDEX(Tabela!$I:$I,MATCH($F9,Tabela!$B:$B,0)),\"\")","v":143.6},{"$f":"IFERROR(INDEX(Tabela!$J:$J,MATCH($F9,Tabela!$B:$B,0)),\"\")","v":1.9588050743418359},null,null,null,null,null,{"$error":"#VALUE!"},null,null,{"$error":"#VALUE!"},null,null,{"$error":"#VALUE!"}]
[null,null,null,null,{"$f":"IFERROR(VLOOKUP(F10,Tabela!$B$1:$C$69,2,FALSE),\"\")","v":"VITAFOR"},{"$f":"IFERROR(INDEX(Tabela!$B$2:$B$69, _xlfn.AGGREGATE(15, 6, (ROW(Tabela!$B$2:$B$69)-ROW(Tabela!$B$2)+1) / ((Tabela!$D$2:$D$69=Principal!$B$7) * (Tabela!$E$2:$E$69=\"Ativo\")), ROW(A8))), \"\")","v":"COLAGENO TIPO II 750MG 60 CAPS"},{"$f":"IFERROR(INDEX(Tabela!$F:$F,MATCH(F10,Tabela!$B:$B,0)),\"\")","v":76.61},{"$f":"IFERROR(INDEX(Tabela!$G:$G,MATCH(F10,Tabela!$B:$B,0)),\"\")","v":129.9},{"$f":"IFERROR(INDEX(Tabela!$H:$H,MATCH($F10,Tabela!$B:$B,0)),\"\")","v":1.6956010964626029},{"$f":"IFERROR(INDEX(Tabela!$I:$I,MATCH($F10,Tabela!$B:$B,0)),\"\")","v":149.4},{"$f":"IFERROR(INDEX(Tabela!$J:$J,MATCH($F10,Tabela!$B:$B,0)),\"\")","v":1.9501370578253492}]
[null,null,null,null,{"$f":"IFERROR(VLOOKUP(F11,Tabela!$B$1:$C$69,2,FALSE),\"\")","v":"BASECOL MIX"},{"$f":"IFERROR(INDEX(Tabela!$B$2:$B$69, _xlfn.AGGREGATE(15, 6, (ROW(Tabela!$B$2:$B$69)-ROW(Tabela!$B$2)+1) / ((Tabela!$D$2:$D$69=Principal!$B$7) * (Tabela!$E$2:$E$69=\"Ativo\")), ROW(A9))), \"\")","v":"COLAGENO VERISOL PO 210G SEM SABOR"},{"$f":"IFERROR(INDEX(Tabela!$F:$F,MATCH(F11,Tabela!$B:$B,0)),\"\")","v":76.989999999999995},{"$f":"IFERROR(INDEX(Tabela!$G:$G,MATCH(F11,Tabela!$B:$B,0)),\"\")","v":119.9},{"$f":"IFERROR(INDEX(Tabela!$H:$H,MATCH($F11,Tabela!$B:$B,0)),\"\")","v":1.5573451097545137},{"$f":"IFERROR(INDEX(Tabela!$I:$I,MATCH($F11,Tabela!$B:$B,0)),\"\")","v":137.9},{"$f":"IFERROR(INDEX(Tabela!$J:$J,MATCH($F11,Tabela!$B:$B,0)),\"\")","v":1.791141706715158}]
[null,null,null,null,{"$f":"IFERROR(VLOOKUP(F12,Tabela!$B$1:$C$69,2,FALSE),\"\")","v":"BASECOL MIX"},{"$f":"IFERROR(INDEX(Tabela!$B$2:$B$69, _xlfn.AGGREGATE(15, 6, (ROW(Tabela!$B$2:$B$69)-ROW(Tabela!$B$2)+1) / ((Tabela!$D$2:$D$69=Principal!$B$7) * (Tabela!$E$2:$E$69=\"Ativo\")), ROW(A10))), \"\")","v":"CREATINA MONOHIDRATADA PECT FR VERM GOMAS 240GR"},{"$f":"IFERROR(INDEX(Tabela!$F:$F,MATCH(F12,Tabela!$B:$B,0)),\"\")","v":69.900000000000006},{"$f":"IFERROR(INDEX(Tabela!$G:$G,MATCH(F12,Tabela!$B:$B,0)),\"\")","v":119.9},{"$f":"IFERROR(INDEX(Tabela!$H:$H,MATCH($F12,Tabela!$B:$B,0)),\"\")","v":1.7153075822603718},{"$f":"IFERROR(INDEX(Tabela!$I:$I,MATCH($F12,Tabela!$B:$B,0)),\"\")","v":137.9},{"$f":"IFERROR(INDEX(Tabela!$J:$J,MATCH($F12,Tabela!$B:$B,0)),\"\")","v":1.9728183118741058}]
[null,{"$error":"#VALUE!"},null,null,{"$f":"IFERROR(VLOOKUP(F13,Tabela!$B$1:$C$69,2,FALSE),\"\")","v":"BASECOL MIX"},{"$f":"IFERROR(INDEX(Tabela!$B$2:$B$69, _xlfn.AGGREGATE(15, 6, (ROW(Tabela!$B$2:$B$69)-ROW(Tabela!$B$2)+1) / ((Tabela!$D$2:$D$69=Principal!$B$7) * (Tabela!$E$2:$E$69=\"Ativo\")), ROW(A11))), \"\")","v":"CREATINA MONOHIDRATADA PECT UVA GOMAS 240GR"},{"$f":"IFERROR(INDEX(Tabela!$F:$F,MATCH(F13,Tabela!$B:$B,0)),\"\")","v":69.900000000000006},{"$f":"IFERROR(INDEX(Tabela!$G:$G,MATCH(F13,Tabela!$B:$B,0)),\"\")","v":119.9},{"$f":"IFERROR(INDEX(Tabela!$H:$H,MATCH($F13,Tabela!$B:$B,0)),\"\")","v":1.7153075822603718},{"$f":"IFERROR(INDEX(Tabela!$I:$I,MATCH($F13,Tabela!$B:$B,0)),\"\")","v":137.9},{"$f":"IFERROR(INDEX(Tabela!$J:$J,MATCH($F13,Tabela!$B:$B,0)),\"\")","v":1.9728183118741058}]
[null,null,null,null,{"$f":"IFERROR(VLOOKUP(F14,Tabela!$B$1:$C$69,2,FALSE),\"\")","v":"VITAFOR"},{"$f":"IFERROR(INDEX(Tabela!$B$2:$B$69, _xlfn.AGGREGATE(15, 6, (ROW(Tabela!$B$2:$B$69)-ROW(Tabela!$B$2)+1) / ((Tabela!$D$2:$D$69=Principal!$B$7) * (Tabela!$E$2:$E$69=\"Ativo\")), ROW(A12))), \"\")","v":"DHA PLUS (OMEGA 3) 120 CAPS 1G"},{"$f":"IFERROR(INDEX(Tabela!$F:$F,MATCH(F14,Tabela!$B:$B,0)),\"\")","v":103.51},{"$f":"IFERROR(INDEX(Tabela!$G:$G,MATCH(F14,Tabela!$B:$B,0)),\"\")","v":173.5},{"$f":"IFERROR(INDEX(Tabela!$H:$H,MATCH($F14,Tabela!$B:$B,0)),\"\")","v":1.6761665539561394},{"$f":"IFERROR(INDEX(Tabela!$I:$I,MATCH($F14,Tabela!$B:$B,0)),\"\")","v":199.5},{"$f":"IFERROR(INDEX(Tabela!$J:$J,MATCH($F14,Tabela!$B:$B,0)),\"\")","v":1.9273500144913533},null,{"$error":"#VALUE!"},null,null,"Fornecedor",null,"Produto",null,null,null,null,"Preço de Custo","Preço Minimo","Markup PM","Preço Sugestivo","Markup PS"]
[null,null,null,null,{"$f":"IFERROR(VLOOKUP(F15,Tabela!$B$1:$C$69,2,FALSE),\"\")","v":"VITAFOR"},{"$f":"IFERROR(INDEX(Tabela!$B$2:$B$69, _xlfn.AGGREGATE(15, 6, (ROW(Tabela!$B$2:$B$69)-ROW(Tabela!$B$2)+1) / ((Tabela!$D$2:$D$69=Principal!$B$7) * (Tabela!$E$2:$E$69=\"Ativo\")), ROW(A13))), \"\")","v":"ENZYMAX SACHES 2G"},{"$f":"IFERROR(INDEX(Tabela!$F:$F,MATCH(F15,Tabela!$B:$B,0)),\"\")","v":43.8},{"$f":"IFERROR(INDEX(Tabela!$G:$G,MATCH(F15,Tabela!$B:$B,0)),\"\")","v":104.89500000000001},{"$f":"IFERROR(INDEX(Tabela!$H:$H,MATCH($F15,Tabela!$B:$B,0)),\"\")","v":2.3948630136986306},{"$f":"IFERROR(INDEX(Tabela!$I:$I,MATCH($F15,Tabela!$B:$B,0)),\"\")","v":120.6},{"$f":"IFERROR(INDEX(Tabela!$J:$J,MATCH($F15,Tabela!$B:$B,0)),\"\")","v":2.7534246575342465},null,null,null,null,{"$f":"IFERROR(VLOOKUP(R15,Tabela!$B$1:$C$69,2,FALSE),\"\")","v":"PASTEUR"},null,{"$f":"IFERROR(INDEX(Tabela!$B$2:$B$69, _xlfn.AGGREGATE(15, 6, (ROW(Tabela!$B$2:$B$69)-ROW(Tabela!$B$2)+1) / ((Tabela!$D$2:$D$69=$M$20) * (Tabela!$E$2:$E$69=\"Ativo\")), ROW(A1))), \"\")","v":"HIDRATANTE CORPORAL MAG 200G"},null,null,null,null,{"$f":"IFERROR(INDEX(Tabela!$F:$F,MATCH(R15,Tabela!$B:$B,0)),\"\")","v":15.74},{"$f":"IFERROR(INDEX(Tabela!$G:$G,MATCH(R15,Tabela!$B:$B,0)),\"\")","v":39.9},{"$f":"IFERROR(INDEX(Tabela!$H:$H,MATCH(R15,Tabela!$B:$B,0)),\"\")","v":2.5349428208386278},{"$f":"IFERROR(INDEX(Tabela!$I:$I,MATCH(R15,Tabela!$B:$B,0)),\"\")","v":45.9},{"$f":"IFERROR(INDEX(Tabela!$J:$J,MATCH(R15,Tabela!$B:$B,0)),\"\")","v":2.9161372299872932}]
{"$rows_left_out":15}
{"sheet":"Regras e Promoções","index":1,"n_rows":45,"n_cols":39,"rows_kept":45,"cut":false,"hidden":false,"merged":[[38,38,39,40],[29,5,30,8],[32,5,33,8],[29,9,30,11],[32,9,33,11],[34,32,36,37],[30,32,32,37],[38,32,40,37],[27,18,29,28],[21,9,22,11],[30,38,31,40],[34,38,35,40],[23,32,24,36],[21,38,22,42],[23,38,24,42],[20,18,22,28],[24,17,25,20],[13,17,14,46],[21,32,22,36],[21,12,22,12],[37,2,44,13],[15,17,15,46],[16,17,16,46],[17,17,17,46],[29,12,30,12],[32,12,33,12],[16,3,17,12],[23,2,28,13],[42,25,47,28],[44,18,46,23],[31,18,33,28],[36,18,41,28],[21,3,22,8]]}
[]
[]
[]
[]
[]
[]
[]
[]
[]
[]
[]
[]
[]
[null,null,null,null,null,null,null,null,null,null,null,null,null,null,null,null,null,"Proibido!"]
[]
{"$rows_left_out":31}
{"sheet":"Impostos","index":2,"n_rows":28,"n_cols":12,"rows_kept":28,"cut":false,"hidden":true,"merged":[]}
["Estado de Destino","ICMS Interestadual","Alíquota Interna","DIFAL","FCP"]
["AC",7.0000000000000007E-2,0.17,0.1,0.02]
["AL",7.0000000000000007E-2,0.18,0.11,0.02,null,null,null,null,"Origem:","RS"]
["AP",7.0000000000000007E-2,0.18,0.11,0.02,null,null,null,null,"Destino:","SP"]
["AM",7.0000000000000007E-2,0.18,0.11,0.02]
["BA",7.0000000000000007E-2,0.18,0.11,0.02,null,null,null,null,"ICMS Interestadual:",{"$f":"INDEX($B$2:$B$28,MATCH($K$3,$A$2:$A$28,0))","v":0.12}]
["CE",7.0000000000000007E-2,0.18,0.11,0.02,null,null,null,null,"Alíquota Interna Destino:",{"$f":"INDEX($C$2:$C$28,MATCH($K$4,$A$2:$A$28,0))","v":0.18}]
["DF",7.0000000000000007E-2,0.18,0.11,0.02,null,null,null,null,"FCP Destino:",{"$f":"INDEX(E2:E28,MATCH($K$4,$A$2:$A$28,0))","v":0.02}]
["ES",0.12,0.17,0.05,0.02,null,null,null,null,"DIFAL:",{"$f":"K7-K6","v":0.06}]
["GO",7.0000000000000007E-2,0.17,0.1,0.02,null,null,null,null,"FCP Origem:",{"$f":"INDEX(E2:E28,MATCH($K$3,$A$2:$A$28,0))","v":0.02}]
["MA",7.0000000000000007E-2,0.18,0.11,0.02]
["MT",7.0000000000000007E-2,0.17,0.1,0.02,null,null,null,null,"Custo:",1000]
["MS",7.0000000000000007E-2,0.17,0.1,0.02,null,null,null,null,"Cálculo:"]
["MG",0.12,0.18,0.06,0.02]
["PA",7.0000000000000007E-2,0.17,0.1,0.02,null,null,null,null,"ICMS Interestadual:",{"$f":"K12*K6","v":120}]
{"$rows_left_out":14}
{"sheet":"Tabela","index":3,"n_rows":69,"n_cols":10,"rows_kept":69,"cut":false,"hidden":true,"merged":[]}
["Produto","Descrição","Fornecedor","Linha","Situação","Preço de Venda","Preço Minimo","Markup PM","Preço Sugestivo","Markup PS"]
[161,"NANO NAILS REPARADOR UNHAS 7ML UN","ATIVA BRASIL","MAESTRINE","ATIVO",21.5,46.65,{"$f":"G2/F2","v":2.1697674418604649},{"$f":"ROUND(G2*1.15,1)","v":53.6},{"$f":"I2/F2","v":2.4930232558139536}]
[45,"HIDRATANTE CORPORAL MAG 200G","PASTEUR","MAG","ATIVO",15.74,39.9,{"$f":"G3/F3","v":2.5349428208386278},{"$f":"ROUND(G3*1.15,1)","v":45.9},{"$f":"I3/F3","v":2.9161372299872932}]
[46,"HIDRATANTE PARA MAOS MAG 60G","PASTEUR","MAG","INATIVO",11,33.9,{"$f":"G4/F4","v":3.0818181818181816},{"$f":"ROUND(G4*1.15,1)","v":39},{"$f":"I4/F4","v":3.5454545454545454}]
[47,"HIDRATANTE PARA PES MAG 60G","PASTEUR","MAG","ATIVO",10.43,25.9,{"$f":"G5/F5","v":2.4832214765100669},{"$f":"ROUND(G5*1.15,1)","v":29.8},{"$f":"I5/F5","v":2.8571428571428572}]
[48,"MANTEIGA CORPORAL MAG 210G","PASTEUR","MAG","ATIVO",17.43,47.9,{"$f":"G6/F6","v":2.7481353987378085},{"$f":"ROUND(G6*1.15,1)","v":55.1},{"$f":"I6/F6","v":3.1612162937464143}]
[57,"NO RED FPS 30 - 100G UNID","NATURELLE","NORED","ATIVO",49.74,89.5,{"$f":"G7/F7","v":1.7993566546039403},{"$f":"ROUND(G7*1.15,1)","v":102.9},{"$f":"I7/F7","v":2.06875753920386}]
[54,"NO RED FPS 40 - 60G UNID.","BOTANIK KOSMETICS","NORED","ATIVO",51.52,95.9,{"$f":"G8/F8","v":1.861413043478261},{"$f":"ROUND(G8*1.15,1)","v":110.3},{"$f":"I8/F8","v":2.1409161490683228}]
[55,"NO RED FPS 50 C/COR 60G UNID.","BOTANIK KOSMETICS","NORED","ATIVO",61.78,108.5,{"$f":"G9/F9","v":1.7562317902233733},{"$f":"ROUND(G9*1.15,1)","v":124.8},{"$f":"I9/F9","v":2.0200712204596956}]
[56,"NO RED LOCAO AUTOBRONZEADORA 120G","KILT DISTRIBUIDORA","NORED","ATIVO",13.83,34.9,{"$f":"G10/F10","v":2.5234996384671002},{"$f":"ROUND(G10*1.15,1)","v":40.1},{"$f":"I10/F10","v":2.8994938539407089}]
[1,"AGARICUSOL 300MG 120 CAPS","AD OCEANUM","PURIS","INATIVO",46.51,81.400000000000006,{"$f":"G11/F11","v":1.7501612556439476},{"$f":"ROUND(G11*1.15,1)","v":93.6},{"$f":"I11/F11","v":2.0124704364652763}]
[8,"BCAA 500MG 120 CAPS","AD OCEANUM","PURIS","INATIVO",45.87,80.3,{"$f":"G12/F12","v":1.750599520383693},{"$f":"ROUND(G12*1.15,1)","v":92.3},{"$f":"I12/F12","v":2.0122084150861128}]
[9,"BERINJELA 450MG 120 CAPS","AD OCEANUM","PURIS","INATIVO",26.21,47.4,{"$f":"G13/F13","v":1.8084700495993895},{"$f":"ROUND(G13*1.15,1)","v":54.5},{"$f":"I13/F13","v":2.0793590232735597}]
[10,"BETACAROTENO 400MG 60 CAPS","AD OCEANUM","PURIS","INATIVO",22.97,40.200000000000003,{"$f":"G14/F14","v":1.7501088376142797},{"$f":"ROUND(G14*1.15,1)","v":46.2},{"$f":"I14/F14","v":2.0113191118850677}]
[58,"BIO OMEGA 3 (18/12) 120 CAPS","VITAFOR","PURIS","ATIVO",59.18,98.9,{"$f":"G15/F15","v":1.6711726934775264},{"$f":"ROUND(G15*1.15,1)","v":113.7},{"$f":"I15/F15","v":1.9212571814802299}]
{"$rows_left_out":54}